Reaction Details
TargetNAD-dependent protein deacetylase sirtuin-3, mitochondrial
LigandBDBM50431121
Substrate/Competitorn/a
Meas. Tech.ChEMBL_948316 (CHEMBL2340697)
IC50 4.9±n/a nM
Citation Disch, JSEvindar, GChiu, CHBlum, CADai, HJin, LSchuman, ELind, KEBelyanskaya, SLDeng, JCoppo, FAquilani, LGraybill, TLCuozzo, JWLavu, SMao, CVlasuk, GPPerni, RB Discovery of thieno[3,2-d]pyrimidine-6-carboxamides as potent inhibitors of SIRT1, SIRT2, and SIRT3. J Med Chem56:3666-79 (2013) 
 
NAD-dependent protein deacetylase sirtuin-3, mitochondrial
Name:NAD-dependent protein deacetylase sirtuin-3, mitochondrial
Type:Protein
Mol. Mass.:43582.69
Organism:Homo sapiens (Human)
Description:Q9NTG7
Residue:399
BDBM50431121
NameBDBM50431121
Synonyms:CHEMBL2332037
TypeSmall organic molecule
Emp. Form.C24H28N6O3S
Mol. Mass.480.583
SMILESCCNC(=O)c1cccc(c1)C(=O)NCCC1CCN(CC1)c1ncnc2cc(sc12)C(N)=O