Reaction Details
TargetNAD-dependent protein deacetylase sirtuin-2
LigandBDBM50431094
Substrate/Competitorn/a
Meas. Tech.ChEMBL_948317 (CHEMBL2341151)
IC50 17±n/a nM
Citation Disch, JSEvindar, GChiu, CHBlum, CADai, HJin, LSchuman, ELind, KEBelyanskaya, SLDeng, JCoppo, FAquilani, LGraybill, TLCuozzo, JWLavu, SMao, CVlasuk, GPPerni, RB Discovery of thieno[3,2-d]pyrimidine-6-carboxamides as potent inhibitors of SIRT1, SIRT2, and SIRT3. J Med Chem56:3666-79 (2013) 
 
NAD-dependent protein deacetylase sirtuin-2
Name:NAD-dependent protein deacetylase sirtuin-2
Type:Hydrolase
Mol. Mass.:43172.62
Organism:Homo sapiens (Human)
Description:n/a
Residue:389
BDBM50431094
NameBDBM50431094
Synonyms:CHEMBL2338809
TypeSmall organic molecule
Emp. Form.C18H26N6O2S
Mol. Mass.390.503
SMILESCC(C)(C)C(=O)NCCN1CCN(CC1)c1ncnc2cc(sc12)C(N)=O