Reaction Details
TargetNAD-dependent protein deacetylase sirtuin-2
LigandBDBM50431095
Substrate/Competitorn/a
Meas. Tech.ChEMBL_948317 (CHEMBL2341151)
IC50 16±n/a nM
Citation Disch, JSEvindar, GChiu, CHBlum, CADai, HJin, LSchuman, ELind, KEBelyanskaya, SLDeng, JCoppo, FAquilani, LGraybill, TLCuozzo, JWLavu, SMao, CVlasuk, GPPerni, RB Discovery of thieno[3,2-d]pyrimidine-6-carboxamides as potent inhibitors of SIRT1, SIRT2, and SIRT3. J Med Chem56:3666-79 (2013) 
 
NAD-dependent protein deacetylase sirtuin-2
Name:NAD-dependent protein deacetylase sirtuin-2
Type:Hydrolase
Mol. Mass.:43172.62
Organism:Homo sapiens (Human)
Description:n/a
Residue:389
BDBM50431095
NameBDBM50431095
Synonyms:CHEMBL2338808
TypeSmall organic molecule
Emp. Form.C20H29N5O2S
Mol. Mass.403.542
SMILESCC(C)(C)C(=O)NCCCC1CCN(CC1)c1ncnc2cc(sc12)C(N)=O