Reaction Details
TargetNAD-dependent protein deacetylase sirtuin-2
LigandBDBM50431118
Substrate/Competitorn/a
Meas. Tech.ChEMBL_948317 (CHEMBL2341151)
IC50 1.8±n/a nM
Citation Disch, JSEvindar, GChiu, CHBlum, CADai, HJin, LSchuman, ELind, KEBelyanskaya, SLDeng, JCoppo, FAquilani, LGraybill, TLCuozzo, JWLavu, SMao, CVlasuk, GPPerni, RB Discovery of thieno[3,2-d]pyrimidine-6-carboxamides as potent inhibitors of SIRT1, SIRT2, and SIRT3. J Med Chem56:3666-79 (2013) 
 
NAD-dependent protein deacetylase sirtuin-2
Name:NAD-dependent protein deacetylase sirtuin-2
Type:Hydrolase
Mol. Mass.:43172.62
Organism:Homo sapiens (Human)
Description:n/a
Residue:389
BDBM50431118
NameBDBM50431118
Synonyms:CHEMBL2332041
TypeSmall organic molecule
Emp. Form.C24H29N5O4S2
Mol. Mass.515.648
SMILESCC(C)(C)OC(=O)c1ccc(s1)C(=O)NCCC1CCN(CC1)c1ncnc2cc(sc12)C(N)=O