Reaction Details
TargetRho-associated protein kinase 1
LigandBDBM50431126
Substrate/Competitorn/a
Meas. Tech.ChEMBL_948342 (CHEMBL2341176)
IC50 13±n/a nM
Citation Yin, YLin, LRuiz, CKhan, SCameron, MDGrant, WPocas, JEid, NPark, HSchröter, TLograsso, PVFeng, Y Synthesis and biological evaluation of urea derivatives as highly potent and selective rho kinase inhibitors. J Med Chem56:3568-81 (2013) 
 
Rho-associated protein kinase 1
Name:Rho-associated protein kinase 1
Type:Serine/threonine-protein kinase
Mol. Mass.:158156.77
Organism:Homo sapiens (Human)
Description:Q13464
Residue:1354
BDBM50431126
NameBDBM50431126
Synonyms:CHEMBL2332069
TypeSmall organic molecule
Emp. Form.C24H29N5O2
Mol. Mass.419.5194
SMILESCOc1cccc(CN(CCN2CCCC2)C(=O)Nc2ccc(cc2)-c2cn[nH]c2)c1