Reaction Details
TargetRho-associated protein kinase 1
LigandBDBM50431133
Substrate/Competitorn/a
Meas. Tech.ChEMBL_948342 (CHEMBL2341176)
IC50 6.0±n/a nM
Citation Yin, YLin, LRuiz, CKhan, SCameron, MDGrant, WPocas, JEid, NPark, HSchröter, TLograsso, PVFeng, Y Synthesis and biological evaluation of urea derivatives as highly potent and selective rho kinase inhibitors. J Med Chem56:3568-81 (2013) 
 
Rho-associated protein kinase 1
Name:Rho-associated protein kinase 1
Type:Serine/threonine-protein kinase
Mol. Mass.:158156.77
Organism:Homo sapiens (Human)
Description:Q13464
Residue:1354
BDBM50431133
NameBDBM50431133
Synonyms:CHEMBL2332059
TypeSmall organic molecule
Emp. Form.C21H25N5O
Mol. Mass.363.4561
SMILESCN(C)CCC(NC(=O)Nc1ccc(cc1)-c1cn[nH]c1)c1ccccc1