Reaction Details
TargetRho-associated protein kinase 2
LigandBDBM50431138
Substrate/Competitorn/a
Meas. Tech.ChEMBL_948348 (CHEMBL2341182)
IC50 1.000000±n/a nM
Citation Yin, YLin, LRuiz, CKhan, SCameron, MDGrant, WPocas, JEid, NPark, HSchröter, TLograsso, PVFeng, Y Synthesis and biological evaluation of urea derivatives as highly potent and selective rho kinase inhibitors. J Med Chem56:3568-81 (2013) 
 
Rho-associated protein kinase 2
Name:Rho-associated protein kinase 2
Type:Protein
Mol. Mass.:160885.43
Organism:Homo sapiens (Human)
Description:O75116
Residue:1388
BDBM50431138
NameBDBM50431138
Synonyms:CHEMBL2332097
TypeSmall organic molecule
Emp. Form.C19H20N4O2
Mol. Mass.336.3877
SMILESCOc1cccc(CN(C)C(=O)Nc2ccc(cc2)-c2cn[nH]c2)c1