Reaction Details
TargetCytochrome P450 1A2
LigandBDBM50431138
Substrate/Competitorn/a
Meas. Tech.ChEMBL_948337 (CHEMBL2341171)
IC50>100000±n/a nM
Citation Yin, YLin, LRuiz, CKhan, SCameron, MDGrant, WPocas, JEid, NPark, HSchröter, TLograsso, PVFeng, Y Synthesis and biological evaluation of urea derivatives as highly potent and selective rho kinase inhibitors. J Med Chem56:3568-81 (2013) 
 
Cytochrome P450 1A2
Name:Cytochrome P450 1A2
Type:Enzyme
Mol. Mass.:58423.38
Organism:Homo sapiens (Human)
Description:P05177
Residue:516
BDBM50431138
NameBDBM50431138
Synonyms:CHEMBL2332097
TypeSmall organic molecule
Emp. Form.C19H20N4O2
Mol. Mass.336.3877
SMILESCOc1cccc(CN(C)C(=O)Nc2ccc(cc2)-c2cn[nH]c2)c1