Reaction Details
TargetSerine/threonine-protein kinase MRCK alpha
LigandBDBM50431138
Substrate/Competitorn/a
Meas. Tech.ChEMBL_948345 (CHEMBL2341179)
IC50 1853±n/a nM
Citation Yin, YLin, LRuiz, CKhan, SCameron, MDGrant, WPocas, JEid, NPark, HSchröter, TLograsso, PVFeng, Y Synthesis and biological evaluation of urea derivatives as highly potent and selective rho kinase inhibitors. J Med Chem56:3568-81 (2013) 
 
Serine/threonine-protein kinase MRCK alpha
Name:Serine/threonine-protein kinase MRCK alpha
Type:Protien
Mol. Mass.:197305.74
Organism:Homo sapiens (Human)
Description:Q5VT25
Residue:1732
BDBM50431138
NameBDBM50431138
Synonyms:CHEMBL2332097
TypeSmall organic molecule
Emp. Form.C19H20N4O2
Mol. Mass.336.3877
SMILESCOc1cccc(CN(C)C(=O)Nc2ccc(cc2)-c2cn[nH]c2)c1