Reaction Details
TargetMitogen-activated protein kinase 10
LigandBDBM50431124
Substrate/Competitorn/a
Meas. Tech.ChEMBL_948344 (CHEMBL2341178)
IC50>20000±n/a nM
Citation Yin, YLin, LRuiz, CKhan, SCameron, MDGrant, WPocas, JEid, NPark, HSchröter, TLograsso, PVFeng, Y Synthesis and biological evaluation of urea derivatives as highly potent and selective rho kinase inhibitors. J Med Chem56:3568-81 (2013) 
 
Mitogen-activated protein kinase 10
Name:Mitogen-activated protein kinase 10
Type:Enzyme
Mol. Mass.:52586.89
Organism:Homo sapiens (Human)
Description:n/a
Residue:464
BDBM50431124
NameBDBM50431124
Synonyms:CHEMBL2332073
TypeSmall organic molecule
Emp. Form.C25H31N5O2
Mol. Mass.433.5459
SMILESCOc1cccc(CN(CCN2CCCCC2)C(=O)Nc2ccc(cc2)-c2cn[nH]c2)c1