Reaction Details
TargetPoly [ADP-ribose] polymerase tankyrase-2
LigandBDBM89825
Substrate/Competitorn/a
Meas. Tech.ChEMBL_948352 (CHEMBL2341186)
IC50 1100±n/a nM
Citation Narwal, MHaikarainen, TFallarero, AVuorela, PMLehtiö, L Screening and structural analysis of flavones inhibiting tankyrases. J Med Chem56:3507-17 (2013) 
 
Poly [ADP-ribose] polymerase tankyrase-2
Name:Poly [ADP-ribose] polymerase tankyrase-2
Type:Enzyme
Mol. Mass.:126937.16
Organism:Homo sapiens (Human)
Description:Q9H2K2
Residue:1166
BDBM89825
NameBDBM89825
Synonyms:2-(4-Fluoro-phenyl)-chromen-4-one 2-(4-fluorophenyl)chromen-4-one MLS000526645 cid_261391
TypeSmall organic molecule
Emp. Form.C15H9FO2
Mol. Mass.240.2292
SMILESFc1ccc(cc1)-c1cc(=O)c2ccccc2o1