Reaction Details
TargetPoly [ADP-ribose] polymerase tankyrase-2
LigandBDBM50431165
Substrate/Competitorn/a
Meas. Tech.ChEMBL_948352 (CHEMBL2341186)
IC50 310±n/a nM
Citation Narwal, MHaikarainen, TFallarero, AVuorela, PMLehtiö, L Screening and structural analysis of flavones inhibiting tankyrases. J Med Chem56:3507-17 (2013) 
 
Poly [ADP-ribose] polymerase tankyrase-2
Name:Poly [ADP-ribose] polymerase tankyrase-2
Type:Enzyme
Mol. Mass.:126937.16
Organism:Homo sapiens (Human)
Description:Q9H2K2
Residue:1166
BDBM50431165
NameBDBM50431165
Synonyms:2-(3-hydroxyphenyl)-4H-chromen-4-one (2) NSC-22356
TypeSmall organic molecule
Emp. Form.C15H10O3
Mol. Mass.238.2381
SMILESOc1cccc(c1)-c1cc(=O)c2ccccc2o1