Reaction Details
TargetPoly [ADP-ribose] polymerase tankyrase-1
LigandBDBM85573
Substrate/Competitorn/a
Meas. Tech.ChEMBL_948354 (CHEMBL2341188)
IC50 560±n/a nM
Citation Narwal, MHaikarainen, TFallarero, AVuorela, PMLehtiö, L Screening and structural analysis of flavones inhibiting tankyrases. J Med Chem56:3507-17 (2013) 
 
Poly [ADP-ribose] polymerase tankyrase-1
Name:Poly [ADP-ribose] polymerase tankyrase-1
Type:Enzyme
Mol. Mass.:142058.03
Organism:Homo sapiens (Human)
Description:O95271
Residue:1327
BDBM85573
NameBDBM85573
Synonyms:7-Hydroxy-flavone, 5h
TypeSmall organic molecule
Emp. Form.C16H12O4
Mol. Mass.268.2641
SMILESCOc1ccc(cc1)-c1cc(=O)c2ccc(O)cc2o1