Reaction Details
TargetPoly [ADP-ribose] polymerase tankyrase-1
LigandBDBM7458
Substrate/Competitorn/a
Meas. Tech.ChEMBL_948354 (CHEMBL2341188)
IC50 3100±n/a nM
Citation Narwal, MHaikarainen, TFallarero, AVuorela, PMLehtiö, L Screening and structural analysis of flavones inhibiting tankyrases. J Med Chem56:3507-17 (2013) 
 
Poly [ADP-ribose] polymerase tankyrase-1
Name:Poly [ADP-ribose] polymerase tankyrase-1
Type:Enzyme
Mol. Mass.:142058.03
Organism:Homo sapiens (Human)
Description:O95271
Residue:1327
BDBM7458
NameBDBM7458
Synonyms:5,7-dihydroxy-2-(4-hydroxyphenyl)-4H-chromen-4-one Apigenin Apigenin (3) Apigenin, 13 Naringenin, 18 US11337935, Compound Apigenin cid_5280443 | jm5b01461, Compound 90
TypeSmall organic molecule
Emp. Form.C15H10O5
Mol. Mass.270.2369
SMILESOc1ccc(cc1)-c1cc(=O)c2c(O)cc(O)cc2o1