Reaction Details
TargetSerine protease 1
LigandBDBM50431213
Substrate/Competitorn/a
Meas. Tech.ChEMBL_948827 (CHEMBL2340209)
Ki>120000±n/a nM
Citation Baeriswyl, VCalzavarini, SGerschheimer, CDiderich, PAngelillo-Scherrer, AHeinis, C Development of a selective peptide macrocycle inhibitor of coagulation factor XII toward the generation of a safe antithrombotic therapy. J Med Chem56:3742-6 (2013) 
 
Serine protease 1
Name:Serine protease 1
Type:Enzyme
Mol. Mass.:26557.80
Organism:Homo sapiens (Human)
Description:P07477
Residue:247
BDBM50431213
NameBDBM50431213
Synonyms:CHEMBL2332604
TypeSmall organic molecule
Emp. Form.C59H82N16O15S3
Mol. Mass.1351.576
SMILES[#6]-[#6@@H]-1-[#7]-[#6](=O)-[#6@@H]-2-[#6]-[#6]-[#6]-[#7]-2-[#6](=O)-[#6@@H]-2-[#6]-[#6]-[#6]-[#7]-2-[#6](=O)-[#6@@H]-2-[#6]-[#16]-[#6]-c3cc(-[#6]-[#16]-[#6]-[#6@H](-[#7]-[#6](=O)-[#6@H](-[#6]-c4ccc(-[#8])cc4)-[#7]-[#6]-1=O)-[#6](=O)-[#7]-[#6]-[#6](-[#8])=O)cc(-[#6]-[#16]-[#6]-[#6@H](-[#7]-[#6](=O)-[#6]-[#7])-[#6](=O)-[#7]-[#6]-[#6](=O)-[#7]-[#6]-[#6](=O)-[#7]-[#6@@H](-[#6]-[#6]-[#6]\[#7]=[#6](\[#7])-[#7])-[#6](=O)-[#7]-1-[#6]-[#6]-[#6]-[#6@H]-1-[#6](=O)-[#7]-2)c3