Reaction Details
TargetProlyl endopeptidase
LigandBDBM50431242
Substrate/Competitorn/a
Meas. Tech.ChEMBL_949248 (CHEMBL2345667)
Ki 3100±n/a nM
Citation Poplawski, SELai, JHLi, YJin, ZLiu, YWu, WWu, YZhou, YSudmeier, JLSanford, DGBachovchin, WW Identification of selective and potent inhibitors of fibroblast activation protein and prolyl oligopeptidase. J Med Chem56:3467-77 (2013) 
 
Prolyl endopeptidase
Name:Prolyl endopeptidase
Type:Enzyme
Mol. Mass.:80688.50
Organism:Homo sapiens (Human)
Description:P48147
Residue:710
BDBM50431242
NameBDBM50431242
Synonyms:CHEMBL2333026
TypeSmall organic molecule
Emp. Form.C13H18BN3O4
Mol. Mass.291.111
SMILESC[C@@H](NC(=O)c1ccncc1)C(=O)N1CCC[C@H]1B(O)O