Reaction Details
TargetHepatocyte growth factor receptor
LigandBDBM50431279
Substrate/Competitorn/a
Meas. Tech.ChEMBL_950788 (CHEMBL2353694)
Kd 65±n/a nM
Citation Suárez, RMChevot, FCavagnino, ASaettel, NRadvanyi, FPiguel, SBernard-Pierrot, IStoven, VLegraverend, M Inhibitors of the TAM subfamily of tyrosine kinases: synthesis and biological evaluation. Eur J Med Chem61:2-25 (2013) 
 
Hepatocyte growth factor receptor
Name:Hepatocyte growth factor receptor
Type:Protein
Mol. Mass.:155559.73
Organism:Homo sapiens (Human)
Description:P08581
Residue:1390
BDBM50431279
NameBDBM50431279
Synonyms:CHEMBL2346680
TypeSmall organic molecule
Emp. Form.C23H14F2N6O3
Mol. Mass.460.3925
SMILESFc1ccc(cc1)-n1cccc(C(=O)Nc2ccc(Oc3ncnc4nc[nH]c34)c(F)c2)c1=O