Reaction Details
TargetTyrosine-protein kinase receptor TYRO3
LigandBDBM50384576
Substrate/Competitorn/a
Meas. Tech.ChEMBL_951054 (CHEMBL2352092)
IC50 48±n/a nM
Citation Suárez, RMChevot, FCavagnino, ASaettel, NRadvanyi, FPiguel, SBernard-Pierrot, IStoven, VLegraverend, M Inhibitors of the TAM subfamily of tyrosine kinases: synthesis and biological evaluation. Eur J Med Chem61:2-25 (2013) 
 
Tyrosine-protein kinase receptor TYRO3
Name:Tyrosine-protein kinase receptor TYRO3
Type:Protein
Mol. Mass.:96894.13
Organism:Homo sapiens (Human)
Description:Q06418
Residue:890
BDBM50384576
NameBDBM50384576
Synonyms:CHEMBL2036808
TypeSmall organic molecule
Emp. Form.C22H29FN6
Mol. Mass.396.5043
SMILESCCCCNc1ncc2c(nn(C[C@H]3CC[C@H](N)CC3)c2n1)-c1ccc(F)cc1