Reaction Details
TargetMyosin light chain kinase, smooth muscle
LigandBDBM50430289
Substrate/Competitorn/a
Meas. Tech.ChEMBL_951386 (CHEMBL2349760)
IC50 4000±n/a nM
Citation Iwatani, MIwata, HOkabe, ASkene, RJTomita, NHayashi, YAramaki, YHosfield, DJHori, ABaba, AMiki, H Discovery and characterization of novel allosteric FAK inhibitors. Eur J Med Chem61:49-60 (2013) 
 
Myosin light chain kinase, smooth muscle
Name:Myosin light chain kinase, smooth muscle
Type:Protein
Mol. Mass.:210702.56
Organism:Homo sapiens (Human)
Description:Q15746
Residue:1914
BDBM50430289
NameBDBM50430289
Synonyms:CHEMBL2333445
TypeSmall organic molecule
Emp. Form.C18H17N3O2S
Mol. Mass.339.411
SMILESCCc1ccc(cc1)-c1ccc2N(C)S(=O)(=O)c3c[nH]nc3-c2c1