Reaction Details
TargetFocal adhesion kinase 1
LigandBDBM50430297
Substrate/Competitorn/a
Meas. Tech.ChEMBL_952942 (CHEMBL2352217)
IC50 1300±n/a nM
Citation Iwatani, MIwata, HOkabe, ASkene, RJTomita, NHayashi, YAramaki, YHosfield, DJHori, ABaba, AMiki, H Discovery and characterization of novel allosteric FAK inhibitors. Eur J Med Chem61:49-60 (2013) 
 
Focal adhesion kinase 1
Name:Focal adhesion kinase 1
Type:Tyrosine-protein kinase
Mol. Mass.:119233.17
Organism:Homo sapiens (Human)
Description:Q05397
Residue:1052
BDBM50430297
NameBDBM50430297
Synonyms:CHEMBL2333436
TypeSmall organic molecule
Emp. Form.C20H21N3O2S
Mol. Mass.367.465
SMILESCCc1ccc(cc1)-c1ccc2N(C)S(=O)(=O)c3cnn(CC)c3-c2c1