Reaction Details
TargetPotassium voltage-gated channel subfamily H member 2
LigandBDBM50431372
Substrate/Competitorn/a
Meas. Tech.ChEMBL_949743 (CHEMBL2350555)
IC50 4150±n/a nM
Citation Padilla, FBhagirath, NChen, SChiao, EGoldstein, DMHermann, JCHsu, JKennedy-Smith, JJKuglstatter, ALiao, CLiu, WLowrie, LELuk, KCLynch, SMMenke, JNiu, LOwens, TDO-Yang, CRailkar, ASchoenfeld, RCSlade, MSteiner, STan, YCVillaseñor, AGWang, CWanner, JXie, WXu, DZhang, XZhou, MLucas, MC Pyrrolopyrazines as selective spleen tyrosine kinase inhibitors. J Med Chem56:1677-92 (2013) 
 
Potassium voltage-gated channel subfamily H member 2
Name:Potassium voltage-gated channel subfamily H member 2
Type:Multi-pass membrane protein
Mol. Mass.:126672.65
Organism:Homo sapiens (Human)
Description:Q12809
Residue:1159
BDBM50431372
NameBDBM50431372
Synonyms:CHEMBL2347988
TypeSmall organic molecule
Emp. Form.C23H26F2N6O4
Mol. Mass.488.4871
SMILESCC(C)(C)NC(=O)c1c[nH]c2ncc(nc12)-c1nn(CCC(O)CO)c2ccc(OC(F)F)cc12