Reaction Details
TargetPotassium voltage-gated channel subfamily H member 2
LigandBDBM50431376
Substrate/Competitorn/a
Meas. Tech.ChEMBL_949743 (CHEMBL2350555)
IC50 414±n/a nM
Citation Padilla, FBhagirath, NChen, SChiao, EGoldstein, DMHermann, JCHsu, JKennedy-Smith, JJKuglstatter, ALiao, CLiu, WLowrie, LELuk, KCLynch, SMMenke, JNiu, LOwens, TDO-Yang, CRailkar, ASchoenfeld, RCSlade, MSteiner, STan, YCVillaseñor, AGWang, CWanner, JXie, WXu, DZhang, XZhou, MLucas, MC Pyrrolopyrazines as selective spleen tyrosine kinase inhibitors. J Med Chem56:1677-92 (2013) 
 
Potassium voltage-gated channel subfamily H member 2
Name:Potassium voltage-gated channel subfamily H member 2
Type:Multi-pass membrane protein
Mol. Mass.:126672.65
Organism:Homo sapiens (Human)
Description:Q12809
Residue:1159
BDBM50431376
NameBDBM50431376
Synonyms:CHEMBL2347417
TypeSmall organic molecule
Emp. Form.C26H28F2N8O2
Mol. Mass.522.5497
SMILESCC(C)(C)NC(=O)c1c[nH]c2ncc(nc12)-c1nn(CCCN2CC(C2)C#N)c2ccc(OC(F)F)cc12