Reaction Details
TargetTyrosine-protein kinase SYK
LigandBDBM50431376
Substrate/Competitorn/a
Meas. Tech.ChEMBL_949752 (CHEMBL2350850)
IC50 534±n/a nM
Citation Padilla, FBhagirath, NChen, SChiao, EGoldstein, DMHermann, JCHsu, JKennedy-Smith, JJKuglstatter, ALiao, CLiu, WLowrie, LELuk, KCLynch, SMMenke, JNiu, LOwens, TDO-Yang, CRailkar, ASchoenfeld, RCSlade, MSteiner, STan, YCVillaseñor, AGWang, CWanner, JXie, WXu, DZhang, XZhou, MLucas, MC Pyrrolopyrazines as selective spleen tyrosine kinase inhibitors. J Med Chem56:1677-92 (2013) 
 
Tyrosine-protein kinase SYK
Name:Tyrosine-protein kinase SYK
Type:Enzyme
Mol. Mass.:72079.99
Organism:Homo sapiens (Human)
Description:P43405
Residue:635
BDBM50431376
NameBDBM50431376
Synonyms:CHEMBL2347417
TypeSmall organic molecule
Emp. Form.C26H28F2N8O2
Mol. Mass.522.5497
SMILESCC(C)(C)NC(=O)c1c[nH]c2ncc(nc12)-c1nn(CCCN2CC(C2)C#N)c2ccc(OC(F)F)cc12