Reaction Details
TargetTyrosine-protein kinase SYK
LigandBDBM50431375
Substrate/Competitorn/a
Meas. Tech.ChEMBL_949753 (CHEMBL2350851)
IC50 195±n/a nM
Citation Padilla, FBhagirath, NChen, SChiao, EGoldstein, DMHermann, JCHsu, JKennedy-Smith, JJKuglstatter, ALiao, CLiu, WLowrie, LELuk, KCLynch, SMMenke, JNiu, LOwens, TDO-Yang, CRailkar, ASchoenfeld, RCSlade, MSteiner, STan, YCVillaseñor, AGWang, CWanner, JXie, WXu, DZhang, XZhou, MLucas, MC Pyrrolopyrazines as selective spleen tyrosine kinase inhibitors. J Med Chem56:1677-92 (2013) 
 
Tyrosine-protein kinase SYK
Name:Tyrosine-protein kinase SYK
Type:Enzyme
Mol. Mass.:72079.99
Organism:Homo sapiens (Human)
Description:P43405
Residue:635
BDBM50431375
NameBDBM50431375
Synonyms:CHEMBL2347418
TypeSmall organic molecule
Emp. Form.C26H31F2N7O3
Mol. Mass.527.5662
SMILESCC(C)(C)NC(=O)c1c[nH]c2ncc(nc12)-c1nn(CCCN2CCOCC2)c2ccc(OC(F)F)cc12