Reaction Details
TargetTyrosine-protein kinase SYK
LigandBDBM50431382
Substrate/Competitorn/a
Meas. Tech.ChEMBL_949757 (CHEMBL2350855)
IC50 3.0±n/a nM
Citation Padilla, FBhagirath, NChen, SChiao, EGoldstein, DMHermann, JCHsu, JKennedy-Smith, JJKuglstatter, ALiao, CLiu, WLowrie, LELuk, KCLynch, SMMenke, JNiu, LOwens, TDO-Yang, CRailkar, ASchoenfeld, RCSlade, MSteiner, STan, YCVillaseñor, AGWang, CWanner, JXie, WXu, DZhang, XZhou, MLucas, MC Pyrrolopyrazines as selective spleen tyrosine kinase inhibitors. J Med Chem56:1677-92 (2013) 
 
Tyrosine-protein kinase SYK
Name:Tyrosine-protein kinase SYK
Type:Enzyme
Mol. Mass.:72079.99
Organism:Homo sapiens (Human)
Description:P43405
Residue:635
BDBM50431382
NameBDBM50431382
Synonyms:CHEMBL2347406
TypeSmall organic molecule
Emp. Form.C19H20N6O2
Mol. Mass.364.4011
SMILESCC(C)(C)NC(=O)c1c[nH]c2ncc(nc12)-c1n[nH]c2c(CO)cccc12