Reaction Details
TargetTyrosine-protein kinase SYK
LigandBDBM50400046
Substrate/Competitorn/a
Meas. Tech.ChEMBL_949757 (CHEMBL2350855)
IC50 7.0±n/a nM
Citation Padilla, FBhagirath, NChen, SChiao, EGoldstein, DMHermann, JCHsu, JKennedy-Smith, JJKuglstatter, ALiao, CLiu, WLowrie, LELuk, KCLynch, SMMenke, JNiu, LOwens, TDO-Yang, CRailkar, ASchoenfeld, RCSlade, MSteiner, STan, YCVillaseñor, AGWang, CWanner, JXie, WXu, DZhang, XZhou, MLucas, MC Pyrrolopyrazines as selective spleen tyrosine kinase inhibitors. J Med Chem56:1677-92 (2013) 
 
Tyrosine-protein kinase SYK
Name:Tyrosine-protein kinase SYK
Type:Enzyme
Mol. Mass.:72079.99
Organism:Homo sapiens (Human)
Description:P43405
Residue:635
BDBM50400046
NameBDBM50400046
Synonyms:CHEMBL2177737
TypeSmall organic molecule
Emp. Form.C27H21N5O5S
Mol. Mass.527.551
SMILESCOc1ccc(Nc2nc(nc3scnc23)-c2cccc(c2)C(=O)Nc2ccc(cc2)C(O)=O)cc1OC