Reaction Details
TargetProstaglandin E synthase
LigandBDBM50431412
Substrate/Competitorn/a
Meas. Tech.ChEMBL_952397 (CHEMBL2352763)
IC50 83±n/a nM
Citation Shiro, TKakiguchi, KTakahashi, HNagata, HTobe, M Synthesis and biological evaluation of substituted imidazoquinoline derivatives as mPGES-1 inhibitors. Bioorg Med Chem21:2068-78 (2013) 
 
Prostaglandin E synthase
Name:Prostaglandin E synthase
Type:Protein
Mol. Mass.:17112.22
Organism:Homo sapiens (Human)
Description:n/a
Residue:152
BDBM50431412
NameBDBM50431412
Synonyms:CHEMBL2348039
TypeSmall organic molecule
Emp. Form.C16H9BrClN3S
Mol. Mass.390.685
SMILESClc1ccccc1-c1nc2c([nH]1)c(=S)[nH]c1cc(Br)ccc21