Reaction Details
TargetProliferating cell nuclear antigen
LigandBDBM50431449
Substrate/Competitorn/a
Meas. Tech.ChEMBL_952429 (CHEMBL2352795)
IC50 14000±n/a nM
Citation Actis, MInoue, AEvison, BPerry, SPunchihewa, CFujii, N Small molecule inhibitors of PCNA/PIP-box interaction suppress translesion DNA synthesis. Bioorg Med Chem21:1972-7 (2013) 
 
Proliferating cell nuclear antigen
Name:Proliferating cell nuclear antigen
Type:PROTEIN
Mol. Mass.:28752.86
Organism:Homo sapiens (Human)
Description:ChEMBL_952429
Residue:261
BDBM50431449
NameBDBM50431449
Synonyms:CHEMBL2348300
TypeSmall organic molecule
Emp. Form.C15H12I3NO5S
Mol. Mass.699.038
SMILESCS(=O)(=O)NC(=O)Cc1cc(I)c(Oc2ccc(O)c(I)c2)c(I)c1