Reaction Details
TargetProliferating cell nuclear antigen
LigandBDBM50431454
Substrate/Competitorn/a
Meas. Tech.ChEMBL_952429 (CHEMBL2352795)
IC50>50000±n/a nM
Citation Actis, MInoue, AEvison, BPerry, SPunchihewa, CFujii, N Small molecule inhibitors of PCNA/PIP-box interaction suppress translesion DNA synthesis. Bioorg Med Chem21:1972-7 (2013) 
 
Proliferating cell nuclear antigen
Name:Proliferating cell nuclear antigen
Type:PROTEIN
Mol. Mass.:28752.86
Organism:Homo sapiens (Human)
Description:ChEMBL_952429
Residue:261
BDBM50431454
NameBDBM50431454
Synonyms:CHEMBL2348295
TypeSmall organic molecule
Emp. Form.C18H18I3NO3
Mol. Mass.677.0538
SMILESCCN(CC)C(=O)Cc1cc(I)c(Oc2ccc(O)c(I)c2)c(I)c1