Reaction Details
TargetProliferating cell nuclear antigen
LigandBDBM50431459
Substrate/Competitorn/a
Meas. Tech.ChEMBL_952429 (CHEMBL2352795)
IC50 1200±n/a nM
Citation Actis, MInoue, AEvison, BPerry, SPunchihewa, CFujii, N Small molecule inhibitors of PCNA/PIP-box interaction suppress translesion DNA synthesis. Bioorg Med Chem21:1972-7 (2013) 
 
Proliferating cell nuclear antigen
Name:Proliferating cell nuclear antigen
Type:PROTEIN
Mol. Mass.:28752.86
Organism:Homo sapiens (Human)
Description:ChEMBL_952429
Residue:261
BDBM50431459
NameBDBM50431459
Synonyms:CHEMBL2348290
TypeSmall organic molecule
Emp. Form.C22H27I2N3O4
Mol. Mass.651.2764
SMILESN[C@H](CNC(=O)CCN1CCOCC1)Cc1cc(I)c(Oc2ccc(O)cc2)c(I)c1