Reaction Details
TargetProliferating cell nuclear antigen
LigandBDBM50431462
Substrate/Competitorn/a
Meas. Tech.ChEMBL_952429 (CHEMBL2352795)
IC50 1500±n/a nM
Citation Actis, MInoue, AEvison, BPerry, SPunchihewa, CFujii, N Small molecule inhibitors of PCNA/PIP-box interaction suppress translesion DNA synthesis. Bioorg Med Chem21:1972-7 (2013) 
 
Proliferating cell nuclear antigen
Name:Proliferating cell nuclear antigen
Type:PROTEIN
Mol. Mass.:28752.86
Organism:Homo sapiens (Human)
Description:ChEMBL_952429
Residue:261
BDBM50431462
NameBDBM50431462
Synonyms:CHEMBL2348287
TypeSmall organic molecule
Emp. Form.C17H18I2N2O3
Mol. Mass.552.1454
SMILESCC(=O)NC[C@@H](N)Cc1cc(I)c(Oc2ccc(O)cc2)c(I)c1