Reaction Details
TargetProliferating cell nuclear antigen
LigandBDBM50431467
Substrate/Competitorn/a
Meas. Tech.ChEMBL_952429 (CHEMBL2352795)
IC50 1300±n/a nM
Citation Actis, MInoue, AEvison, BPerry, SPunchihewa, CFujii, N Small molecule inhibitors of PCNA/PIP-box interaction suppress translesion DNA synthesis. Bioorg Med Chem21:1972-7 (2013) 
 
Proliferating cell nuclear antigen
Name:Proliferating cell nuclear antigen
Type:PROTEIN
Mol. Mass.:28752.86
Organism:Homo sapiens (Human)
Description:ChEMBL_952429
Residue:261
BDBM50431467
NameBDBM50431467
Synonyms:CHEMBL2348305
TypeSmall organic molecule
Emp. Form.C15H15I2NO3
Mol. Mass.511.0934
SMILESN[C@H](CO)Cc1cc(I)c(Oc2ccc(O)cc2)c(I)c1