Reaction Details
TargetProliferating cell nuclear antigen
LigandBDBM18860
Substrate/Competitorn/a
Meas. Tech.ChEMBL_952429 (CHEMBL2352795)
IC50 3600±n/a nM
Citation Actis, MInoue, AEvison, BPerry, SPunchihewa, CFujii, N Small molecule inhibitors of PCNA/PIP-box interaction suppress translesion DNA synthesis. Bioorg Med Chem21:1972-7 (2013) 
 
Proliferating cell nuclear antigen
Name:Proliferating cell nuclear antigen
Type:PROTEIN
Mol. Mass.:28752.86
Organism:Homo sapiens (Human)
Description:ChEMBL_952429
Residue:261
BDBM18860
NameBDBM18860
Synonyms:(2R)-2-amino-3-[4-(4-hydroxy-3-iodophenoxy)-3,5-diiodophenyl]propanoic acid 3,5,3'-triiodo-L-thyronine (T3) Triiodothyronine US10544075, Compound T3 liothyronine | triothyrone
TypeHormone
Emp. Form.C15H12I3NO4
Mol. Mass.650.9735
SMILESN[C@@H](Cc1cc(I)c(Oc2ccc(O)c(I)c2)c(I)c1)C(O)=O