Reaction Details
TargetHeparanase
LigandBDBM50175811
Substrate/Competitorn/a
Meas. Tech.ChEMBL_950897 (CHEMBL2349721)
IC50 230±n/a nM
Citation Gozalbes, RMosulén, SOrtí, LRodríguez-Díaz, JCarbajo, RJMelnyk, PPineda-Lucena, A Hit identification of novel heparanase inhibitors by structure- and ligand-based approaches. Bioorg Med Chem21:1944-51 (2013) 
 
Heparanase
Name:Heparanase
Type:PROTEIN
Mol. Mass.:61167.67
Organism:Homo sapiens (Human)
Description:ChEMBL_327900
Residue:543
BDBM50175811
NameBDBM50175811
Synonyms:CHEMBL200215 | N-(4-{[4-(1H-benzoimidazol-2-yl)phenylamino]methyl}phenyl)-3-bromo-4-methoxy-benzamide
TypeSmall organic molecule
Emp. Form.C28H23BrN4O2
Mol. Mass.527.412
SMILESCOc1ccc(cc1Br)C(=O)Nc1ccc(CNc2ccc(cc2)-c2nc3ccccc3[nH]2)cc1