Reaction Details
TargetHeparanase
LigandBDBM50175932
Substrate/Competitorn/a
Meas. Tech.ChEMBL_950897 (CHEMBL2349721)
IC50 75±n/a nM
Citation Gozalbes, RMosulén, SOrtí, LRodríguez-Díaz, JCarbajo, RJMelnyk, PPineda-Lucena, A Hit identification of novel heparanase inhibitors by structure- and ligand-based approaches. Bioorg Med Chem21:1944-51 (2013) 
 
Heparanase
Name:Heparanase
Type:PROTEIN
Mol. Mass.:61167.67
Organism:Homo sapiens (Human)
Description:ChEMBL_327900
Residue:543
BDBM50175932
NameBDBM50175932
Synonyms:1,3-bis-[4-(5,6-dimethyl-1H-benzoimidazol-2-yl)phenyl]urea | CHEMBL200597
TypeSmall organic molecule
Emp. Form.C31H28N6O
Mol. Mass.500.5936
SMILESCc1cc2nc([nH]c2cc1C)-c1ccc(NC(=O)Nc2ccc(cc2)-c2nc3cc(C)c(C)cc3[nH]2)cc1