Reaction Details
TargetDNA (cytosine-5)-methyltransferase 1
LigandBDBM50431676
Substrate/Competitorn/a
Meas. Tech.ChEMBL_951488 (CHEMBL2350641)
IC50 1900±n/a nM
Citation Yu, WSmil, DLi, FTempel, WFedorov, ONguyen, KTBolshan, YAl-Awar, RKnapp, SArrowsmith, CHVedadi, MBrown, PJSchapira, M Bromo-deaza-SAH: a potent and selective DOT1L inhibitor. Bioorg Med Chem21:1787-94 (2013) 
 
DNA (cytosine-5)-methyltransferase 1
Name:DNA (cytosine-5)-methyltransferase 1
Type:Enzyme
Mol. Mass.:183184.85
Organism:Homo sapiens (Human)
Description:P26358
Residue:1616
BDBM50431676
NameBDBM50431676
Synonyms:CHEMBL2349526
TypeSmall organic molecule
Emp. Form.C15H20BrN5O5S
Mol. Mass.462.319
SMILESN[C@@H](CCSC[C@H]1O[C@H]([C@H](O)[C@@H]1O)n1cc(Br)c2c(N)ncnc12)C(O)=O