Reaction Details
TargetDipeptidyl peptidase 4
LigandBDBM50431783
Substrate/Competitorn/a
Meas. Tech.ChEMBL_951849 (CHEMBL2353262)
IC50 16±n/a nM
Citation Zeng, SXie, HZeng, LLLu, XZhao, XZhang, GCTu, ZCXu, HJYang, LZhang, XQHu, W Discovery of potent dipeptidyl peptidase IV inhibitors through pharmacophore hybridization and hit-to-lead optimization. Bioorg Med Chem21:1749-55 (2013) 
 
Dipeptidyl peptidase 4
Name:Dipeptidyl peptidase 4
Type:Enzyme
Mol. Mass.:88271.01
Organism:Homo sapiens (Human)
Description:P27487
Residue:766
BDBM50431783
NameBDBM50431783
Synonyms:CHEMBL2347038
TypeSmall organic molecule
Emp. Form.C25H27N7O
Mol. Mass.441.5282
SMILESCC#CCn1c(nc2ccn(Cc3nc4ccccc4nc3C)c2c1=O)N1CCC[C@@H](N)C1