Reaction Details
TargetDipeptidyl peptidase 4
LigandBDBM50431792
Substrate/Competitorn/a
Meas. Tech.ChEMBL_951849 (CHEMBL2353262)
IC50 48±n/a nM
Citation Zeng, SXie, HZeng, LLLu, XZhao, XZhang, GCTu, ZCXu, HJYang, LZhang, XQHu, W Discovery of potent dipeptidyl peptidase IV inhibitors through pharmacophore hybridization and hit-to-lead optimization. Bioorg Med Chem21:1749-55 (2013) 
 
Dipeptidyl peptidase 4
Name:Dipeptidyl peptidase 4
Type:Enzyme
Mol. Mass.:88271.01
Organism:Homo sapiens (Human)
Description:P27487
Residue:766
BDBM50431792
NameBDBM50431792
Synonyms:CHEMBL2346925
TypeSmall organic molecule
Emp. Form.C25H26N6O
Mol. Mass.426.5135
SMILESCC#CCn1c(nc2ccn(Cc3ccnc4ccccc34)c2c1=O)N1CCC[C@@H](N)C1