Reaction Details
TargetCannabinoid receptor 2
LigandBDBM50431802
Substrate/Competitorn/a
Meas. Tech.ChEMBL_951851 (CHEMBL2353264)
Ki>40000±n/a nM
Citation Alvarado, MDecara, JLuque, MJHernandez-Folgado, LGómez-Cañas, MGómez-Ruiz, MFernández-Ruiz, JElguero, JJagerovic, NSerrano, AGoya, Pde Fonseca, FR Novel antiobesity agents: synthesis and pharmacological evaluation of analogues of Rimonabant and of LH21. Bioorg Med Chem21:1708-16 (2013) 
 
Cannabinoid receptor 2
Name:Cannabinoid receptor 2
Type:G Protein-Coupled Receptor (GPCR)
Mol. Mass.:39690.94
Organism:Homo sapiens (Human)
Description:P34972
Residue:360
BDBM50431802
NameBDBM50431802
Synonyms:CHEMBL2347046
TypeSmall organic molecule
Emp. Form.C35H49N3O
Mol. Mass.527.7831
SMILESCCCCCCCC\C=C/CCCCCCCCNC(=O)c1nn(c(c1C)-c1ccccc1)-c1ccccc1