Reaction Details
TargetCannabinoid receptor 1
LigandBDBM50431807
Substrate/Competitorn/a
Meas. Tech.ChEMBL_951850 (CHEMBL2353263)
Ki>40000±n/a nM
Citation Alvarado, MDecara, JLuque, MJHernandez-Folgado, LGómez-Cañas, MGómez-Ruiz, MFernández-Ruiz, JElguero, JJagerovic, NSerrano, AGoya, Pde Fonseca, FR Novel antiobesity agents: synthesis and pharmacological evaluation of analogues of Rimonabant and of LH21. Bioorg Med Chem21:1708-16 (2013) 
 
Cannabinoid receptor 1
Name:Cannabinoid receptor 1
Type:G Protein-Coupled Receptor (GPCR)
Mol. Mass.:52868.96
Organism:Homo sapiens (Human)
Description:P21554
Residue:472
BDBM50431807
NameBDBM50431807
Synonyms:CHEMBL2347041
TypeSmall organic molecule
Emp. Form.C20H19Cl3N2
Mol. Mass.393.737
SMILESCCCCCc1cc(-c2ccc(Cl)cc2)n(n1)-c1ccc(Cl)cc1Cl