Reaction Details
TargetRibosomal protein S6 kinase alpha-3
LigandBDBM50431812
Substrate/Competitorn/a
Meas. Tech.ChEMBL_952155 (CHEMBL2350682)
IC50 1.6±n/a nM
Citation Zhong, YXue, MZhao, XYuan, JLiu, XHuang, JZhao, ZLi, HXu, Y Substituted indolin-2-ones as p90 ribosomal S6 protein kinase 2 (RSK2) inhibitors: Molecular docking simulation and structure-activity relationship analysis. Bioorg Med Chem21:1724-34 (2013) 
 
Ribosomal protein S6 kinase alpha-3
Name:Ribosomal protein S6 kinase alpha-3
Type:Serine/threonine-protein kinase
Mol. Mass.:83740.03
Organism:Homo sapiens (Human)
Description:The human RSK2 sequence differed from the Genbank entry NM_004586 at one residue, V45G. The protein was cloned and purified from baculovirus expression system.
Residue:740
BDBM50431812
NameBDBM50431812
Synonyms:CHEMBL2347053
TypeSmall organic molecule
Emp. Form.C18H12N4O3
Mol. Mass.332.3129
SMILES[O-][N+](=O)c1ccccc1-c1n[nH]cc1C=C1C(=O)Nc2ccccc12