Reaction Details
TargetRibosomal protein S6 kinase alpha-3
LigandBDBM50431816
Substrate/Competitorn/a
Meas. Tech.ChEMBL_951857 (CHEMBL2353270)
IC50 7760±n/a nM
Citation Zhong, YXue, MZhao, XYuan, JLiu, XHuang, JZhao, ZLi, HXu, Y Substituted indolin-2-ones as p90 ribosomal S6 protein kinase 2 (RSK2) inhibitors: Molecular docking simulation and structure-activity relationship analysis. Bioorg Med Chem21:1724-34 (2013) 
 
Ribosomal protein S6 kinase alpha-3
Name:Ribosomal protein S6 kinase alpha-3
Type:Serine/threonine-protein kinase
Mol. Mass.:83740.03
Organism:Homo sapiens (Human)
Description:The human RSK2 sequence differed from the Genbank entry NM_004586 at one residue, V45G. The protein was cloned and purified from baculovirus expression system.
Residue:740
BDBM50431816
NameBDBM50431816
Synonyms:CHEMBL2347073
TypeSmall organic molecule
Emp. Form.C13H9NO2
Mol. Mass.211.2161
SMILESO=C1Nc2ccccc2\C1=C\c1ccco1