Reaction Details
TargetVascular endothelial growth factor receptor 2
LigandBDBM50431812
Substrate/Competitorn/a
Meas. Tech.ChEMBL_952143 (CHEMBL2350670)
IC50 7.7±n/a nM
Citation Zhong, YXue, MZhao, XYuan, JLiu, XHuang, JZhao, ZLi, HXu, Y Substituted indolin-2-ones as p90 ribosomal S6 protein kinase 2 (RSK2) inhibitors: Molecular docking simulation and structure-activity relationship analysis. Bioorg Med Chem21:1724-34 (2013) 
 
Vascular endothelial growth factor receptor 2
Name:Vascular endothelial growth factor receptor 2
Type:Receptor Tyrosine Kinase
Mol. Mass.:151510.97
Organism:Homo sapiens (Human)
Description:P35968
Residue:1356
BDBM50431812
NameBDBM50431812
Synonyms:CHEMBL2347053
TypeSmall organic molecule
Emp. Form.C18H12N4O3
Mol. Mass.332.3129
SMILES[O-][N+](=O)c1ccccc1-c1n[nH]cc1C=C1C(=O)Nc2ccccc12