Reaction Details
TargetKappa-type opioid receptor
LigandBDBM50431839
Substrate/Competitorn/a
Meas. Tech.ChEMBL_952453 (CHEMBL2353046)
Ki 2.2±n/a nM
Citation VanAlstine, MAWentland, MPAlvarez, JCao, QCohen, DJKnapp, BIBidlack, JM Redefining the structure-activity relationships of 2,6-methano-3-benzazocines. Part 9: Synthesis, characterization and molecular modeling of pyridinyl isosteres of N-BPE-8-CAC (1), a high affinity ligand for opioid receptors. Bioorg Med Chem Lett23:2128-33 (2013) 
 
Kappa-type opioid receptor
Name:Kappa-type opioid receptor
Type:G Protein-Coupled Receptor (GPCR)
Mol. Mass.:42648.76
Organism:Homo sapiens (Human)
Description:P41145
Residue:380
BDBM50431839
NameBDBM50431839
Synonyms:CHEMBL2347236
TypeSmall organic molecule
Emp. Form.C32H37N3O
Mol. Mass.479.6557
SMILESC[C@H]1C2Cc3ccc(cc3[C@@]1(C)CCN2CC1CC1)C(=O)NCCc1ccc(cc1)-c1cccnc1