Reaction Details
TargetA disintegrin and metalloproteinase with thrombospondin motifs 5
LigandBDBM50431936
Substrate/Competitorn/a
Meas. Tech.ChEMBL_953681 (CHEMBL2352585)
IC50 1000±n/a nM
Citation Atobe, MMaekawara, NIshiguro, NSogame, SSuenaga, YKawanishi, MSuzuki, HJinno, NTanaka, EMiyoshi, S A series of thiazole derivatives bearing thiazolidin-4-one as non-competitive ADAMTS-5 (aggrecanase-2) inhibitors. Bioorg Med Chem Lett23:2106-10 (2013) 
 
A disintegrin and metalloproteinase with thrombospondin motifs 5
Name:A disintegrin and metalloproteinase with thrombospondin motifs 5
Type:Enzyme
Mol. Mass.:101769.09
Organism:Homo sapiens (Human)
Description:Q9UNA0
Residue:930
BDBM50431936
NameBDBM50431936
Synonyms:CHEMBL2348072
TypeSmall organic molecule
Emp. Form.C16H14N2O4S2
Mol. Mass.362.423
SMILESCOc1ccc(cc1)-c1nc(\C=C2/NC(=O)CS2)sc1CC(O)=O