Reaction Details
TargetA disintegrin and metalloproteinase with thrombospondin motifs 13
LigandBDBM50431942
Substrate/Competitorn/a
Meas. Tech.ChEMBL_953678 (CHEMBL2352582)
IC50 12000±n/a nM
Citation Atobe, MMaekawara, NIshiguro, NSogame, SSuenaga, YKawanishi, MSuzuki, HJinno, NTanaka, EMiyoshi, S A series of thiazole derivatives bearing thiazolidin-4-one as non-competitive ADAMTS-5 (aggrecanase-2) inhibitors. Bioorg Med Chem Lett23:2106-10 (2013) 
 
A disintegrin and metalloproteinase with thrombospondin motifs 13
Name:A disintegrin and metalloproteinase with thrombospondin motifs 13
Type:PROTEIN
Mol. Mass.:153616.59
Organism:Homo sapiens (Human)
Description:ChEMBL_953678
Residue:1427
BDBM50431942
NameBDBM50431942
Synonyms:CHEMBL2347847
TypeSmall organic molecule
Emp. Form.C15H12N2O3S2
Mol. Mass.332.397
SMILESOC(=O)Cc1sc(\C=C2/NC(=O)CS2)nc1-c1ccccc1