Reaction Details
TargetArginase-1
LigandBDBM50350311
Substrate/Competitorn/a
Meas. Tech.ChEMBL_954163 (CHEMBL2351678)
IC50 800±n/a nM
Citation Golebiowski, APaul Beckett, RVan Zandt, MJi, MKWhitehouse, DRyder, TRJagdmann, EAndreoli, MMazur, APadmanilayam, MCousido-Siah, AMitschler, ARuiz, FXPodjarny, ASchroeter, H 2-Substituted-2-amino-6-boronohexanoic acids as arginase inhibitors. Bioorg Med Chem Lett23:2027-30 (2013) 
 
Arginase-1
Name:Arginase-1
Type:PROTEIN
Mol. Mass.:34737.53
Organism:Homo sapiens (Human)
Description:ChEMBL_978893
Residue:322
BDBM50350311
NameBDBM50350311
Synonyms:CHEMBL1812661
TypeSmall organic molecule
Emp. Form.C6H14BNO4
Mol. Mass.174.991
SMILES[NH3+][C@@H](CCCCB(O)O)C([O-])=O