Reaction Details
TargetCasein kinase I isoform alpha
LigandBDBM50432007
Substrate/Competitorn/a
Meas. Tech.ChEMBL_954191 (CHEMBL2351706)
IC50>10000±n/a nM
Citation Elagawany, MIbrahim, MAAli Ahmed, HEEl-Etrawy, AShGhiaty, AAbdel-Samii, ZKEl-Feky, SABajorath, J Design, synthesis, and molecular modelling of pyridazinone and phthalazinone derivatives as protein kinases inhibitors. Bioorg Med Chem Lett23:2007-13 (2013) 
 
Casein kinase I isoform alpha
Name:Casein kinase I isoform alpha
Type:PROTEIN
Mol. Mass.:14639.55
Organism:Sus scrofa
Description:ChEMBL_939731
Residue:125
BDBM50432007
NameBDBM50432007
Synonyms:CHEMBL2348736
TypeSmall organic molecule
Emp. Form.C17H12ClN3O
Mol. Mass.309.75
SMILESClc1nnc(NC(=O)c2ccccc2)cc1-c1ccccc1