Reaction Details
TargetCasein kinase I isoform alpha
LigandBDBM50432010
Substrate/Competitorn/a
Meas. Tech.ChEMBL_954191 (CHEMBL2351706)
IC50>10000±n/a nM
Citation Elagawany, MIbrahim, MAAli Ahmed, HEEl-Etrawy, AShGhiaty, AAbdel-Samii, ZKEl-Feky, SABajorath, J Design, synthesis, and molecular modelling of pyridazinone and phthalazinone derivatives as protein kinases inhibitors. Bioorg Med Chem Lett23:2007-13 (2013) 
 
Casein kinase I isoform alpha
Name:Casein kinase I isoform alpha
Type:PROTEIN
Mol. Mass.:14639.55
Organism:Sus scrofa
Description:ChEMBL_939731
Residue:125
BDBM50432010
NameBDBM50432010
Synonyms:CHEMBL2348733
TypeSmall organic molecule
Emp. Form.C10H9N3O
Mol. Mass.187.198
SMILESNc1n[nH]c(=O)cc1-c1ccccc1