Reaction Details
TargetExtracellular calcium-sensing receptor
LigandBDBM50432114
Substrate/Competitorn/a
Meas. Tech.ChEMBL_950625 (CHEMBL2352375)
EC50 1000±n/a nM
Citation Temal, TJary, HAuberval, MLively, SGuédin, DVevert, JPDeprez, P New potent calcimimetics: I. Discovery of a series of novel trisubstituted ureas. Bioorg Med Chem Lett23:2451-4 (2013) 
 
Extracellular calcium-sensing receptor
Name:Extracellular calcium-sensing receptor
Type:Protein
Mol. Mass.:120663.13
Organism:Homo sapiens (Human)
Description:P41180
Residue:1078
BDBM50432114
NameBDBM50432114
Synonyms:CHEMBL2349574
TypeSmall organic molecule
Emp. Form.C29H34N8O2
Mol. Mass.526.6327
SMILESO=C(Nc1cccc(Nc2nnn[nH]2)c1)N(CCC(c1ccccc1)c1ccccc1)CCN1CCOCC1